Forum pour réunir les administrateurs de serveur L2
 
AccueilAccueil  FAQFAQ  RechercherRechercher  S'enregistrerS'enregistrer  MembresMembres  GroupesGroupes  Connexion  

Partagez | 
 

 [Résolu] probleme de compilation

Voir le sujet précédent Voir le sujet suivant Aller en bas 
AuteurMessage
Eristos



Nombre de messages : 43
Age : 29
Date d'inscription : 12/06/2007

MessageSujet: [Résolu] probleme de compilation   Lun 20 Oct 2008, 19:50

Bonjour,

j'essai de comiler le trunk du svn de l2jfree à jour d'aujourd'hui sans succes.
Pouriez-vous m'aider ?

voici ma console:
Code:
[INFO] Scanning for projects...
[INFO] Attempting to resolve a version for plugin: org.codehaus.mojo:maven-buildnumber-plugin using meta-version: LATEST
[INFO] Using version: 0.9.5 of plugin: org.codehaus.mojo:maven-buildnumber-plugin
[INFO] ------------------------------------------------------------------------
[INFO] Building Unnamed - l2jfree:l2jfree-core:jar:1.2.3
[INFO]
[INFO] Id: l2jfree:l2jfree-core:jar:1.2.3
[INFO] task-segment: [assembly:assembly] (aggregator-style)
[INFO] ------------------------------------------------------------------------
[INFO] [statemgmt:start-fork]
[INFO] Starting forked execution [fork id: 455632671]
[INFO] [buildnumber:create]
[INFO] Storing buildNumber: 4723
[INFO] [resources:resources]
[INFO] Using default encoding to copy filtered resources.
[INFO] [compiler:compile]
[INFO] Compiling 1382 source files to C:\Documents and Settings\hoanno\Mes documents\serveur\trunk\l2jfree-core\target\classes
[INFO] [resources:testResources]
[INFO] Using default encoding to copy filtered resources.
[INFO] [compiler:testCompile]
[INFO] Compiling 17 source files to C:\Documents and Settings\hoanno\Mes documents\serveur\trunk\l2jfree-core\target\test-classes
[INFO] [surefire:test]
[INFO] Surefire report directory: C:\Documents and Settings\hoanno\Mes documents\serveur\trunk\l2jfree-core\target\surefire-reports

-------------------------------------------------------
 T E S T S
-------------------------------------------------------
Running com.l2jfree.gameserver.script.TestDateRange
20 oct. 2008 18:48:54 com.l2jfree.gameserver.script.DateRange parse
ATTENTION: Invalid Date Format for a dateRange.
Tests run: 5, Failures: 0, Errors: 0, Skipped: 0, Time elapsed: 0.125 sec
Running com.l2jfree.gameserver.script.TestscriptDocument
Tests run: 3, Failures: 1, Errors: 0, Skipped: 0, Time elapsed: 0.172 sec <<< FAILURE!
Running com.l2jfree.gameserver.templates.TestL2PcTemplate
Tests run: 1, Failures: 0, Errors: 0, Skipped: 0, Time elapsed: 0.14 sec
Running com.l2jfree.gameserver.jdklogextensions.ItemLogFormatterTest
Tests run: 1, Failures: 1, Errors: 0, Skipped: 0, Time elapsed: 0.219 sec <<< FAILURE!
Running com.l2jfree.gameserver.skills.funcs.TestFuncTemplate
Tests run: 3, Failures: 0, Errors: 0, Skipped: 0, Time elapsed: 0.094 sec
Running com.l2jfree.gameserver.script.TestIntList
Tests run: 3, Failures: 0, Errors: 0, Skipped: 0, Time elapsed: 0.062 sec
Running com.l2jfree.gameserver.skills.funcs.TestFuncAdd
Tests run: 1, Failures: 0, Errors: 0, Skipped: 0, Time elapsed: 0.062 sec
Running com.l2jfree.gameserver.skills.funcs.TestFuncSub
Tests run: 1, Failures: 0, Errors: 0, Skipped: 0, Time elapsed: 0.078 sec
Running com.l2jfree.gameserver.skills.funcs.TestFuncDiv
Tests run: 2, Failures: 0, Errors: 0, Skipped: 0, Time elapsed: 0.047 sec
Running com.l2jfree.gameserver.skills.funcs.TestFuncSet
Tests run: 1, Failures: 0, Errors: 0, Skipped: 0, Time elapsed: 0.047 sec
Running com.l2jfree.gameserver.model.TestL2Skill
20 oct. 2008 18:49:03 com.l2jfree.L2DatabaseFactory <init>
ATTENTION: at least 2 db connections are required.
INFO : MLog clients using log4j logging. 
INFO : Initializing c3p0-0.9.1.2 [built 21-May-2007 15:04:56; debug? true; trace: 10] 
INFO : Initializing c3p0 pool... com.mchange.v2.c3p0.ComboPooledDataSource [ java.beans.IntrospectionException: java.lang.reflect.InvocationTargetException [numThreadsAwaitingCheckoutDefaultUser] ] 
20 oct. 2008 18:49:04 com.l2jfree.gameserver.datatables.SkillTreeTable <init>
GRAVE: Error while creating skill tree (Class ID 0):java.sql.SQLException: L2DatabaseFactory: Failed to init database connections: java.lang.NullPointerException
20 oct. 2008 18:49:04 com.l2jfree.gameserver.datatables.SkillTreeTable <init>
INFO: SkillTreeTable: Loaded 0 skills.
20 oct. 2008 18:49:04 com.l2jfree.gameserver.datatables.SkillTreeTable <init>
GRAVE: Error while creating fishing skill table: java.lang.NullPointerException
20 oct. 2008 18:49:04 com.l2jfree.gameserver.datatables.SkillTreeTable <init>
GRAVE: Error while creating enchant skill table: java.lang.NullPointerException
20 oct. 2008 18:49:04 com.l2jfree.gameserver.datatables.SkillTreeTable <init>
GRAVE: Error while creating fishing skill table: java.lang.NullPointerException
20 oct. 2008 18:49:04 com.l2jfree.gameserver.datatables.SkillTreeTable <init>
GRAVE: Error while creating Transformation skill table java.lang.NullPointerException
20 oct. 2008 18:49:04 com.l2jfree.gameserver.datatables.SkillTreeTable <init>
INFO: FishingSkillTreeTable:  Loaded 0 general skills.
20 oct. 2008 18:49:04 com.l2jfree.gameserver.datatables.SkillTreeTable <init>
INFO: FishingSkillTreeTable:  Loaded 0 dwarven skills.
20 oct. 2008 18:49:04 com.l2jfree.gameserver.datatables.SkillTreeTable <init>
Tests run: 1, Failures: 0, Errors: 0, Skipped: 0, Time elapsed: 0.984 sec
INFO: EnchantSkillTreeTable:  Loaded 0 enchant skills.
20 oct. 2008 18:49:04 com.l2jfree.gameserver.datatables.SkillTreeTable <init>
INFO: PledgeSkillTreeTable:    Loaded 0 pledge skills.
20 oct. 2008 18:49:04 com.l2jfree.gameserver.datatables.SkillTreeTable <init>
INFO: TransformSkillTreeTable: Loaded 0 transform skills.
Running com.l2jfree.gameserver.skills.funcs.TestFuncMul
Tests run: 1, Failures: 0, Errors: 0, Skipped: 0, Time elapsed: 0.063 sec
Running com.l2jfree.gameserver.script.TestscriptPackage
Tests run: 4, Failures: 1, Errors: 0, Skipped: 0, Time elapsed: 0.172 sec <<< FAILURE!
Running com.l2jfree.gameserver.jdklogextensions.AuditLogFormatterTest
Tests run: 1, Failures: 1, Errors: 0, Skipped: 0, Time elapsed: 0.203 sec <<< FAILURE!
Running com.l2jfree.gameserver.templates.TestL2NpcTemplate
Tests run: 2, Failures: 0, Errors: 0, Skipped: 0, Time elapsed: 0.141 sec

Results :

Failed tests:

Tests run: 30, Failures: 4, Errors: 0, Skipped: 0

[ERROR]

Mojo (aggregator):

    org.apache.maven.plugins:maven-surefire-plugin:2.4.2:test

FAILED while executing in directory:

    C:\Documents and Settings\hoanno\Mes documents\serveur\trunk\l2jfree-core

Reason:

There are test failures.

Please refer to C:\Documents and Settings\hoanno\Mes documents\serveur\trunk\l2jfree-core\target\surefire-reports for the individual test results.




[INFO] ------------------------------------------------------------------------
[INFO] For more information, run with the -e flag
[INFO] ------------------------------------------------------------------------
[INFO] BUILD FAILED
[INFO] ------------------------------------------------------------------------
[INFO] Total time: 37 seconds
[INFO] Finished at: Mon Oct 20 18:49:06 CEST 2008
[INFO] Final Memory: 36M/508M
[INFO] ------------------------------------------------------------------------


Dernière édition par Eristos le Lun 20 Oct 2008, 22:07, édité 1 fois
Revenir en haut Aller en bas
Voir le profil de l'utilisateur http://www.fireemperor.fr/
Respawner



Nombre de messages : 1622
Age : 28
Date d'inscription : 20/04/2006

MessageSujet: Re: [Résolu] probleme de compilation   Lun 20 Oct 2008, 20:09

Compile sans les tests.
Code:
mvn assembly:assembly -U -Dmaven.test.skip=true

_________________
~$ cat new_server > /dev/null

Tout n'est qu'une question de point de vue.
Revenir en haut Aller en bas
Voir le profil de l'utilisateur http://www.respawner.fr/
Eristos



Nombre de messages : 43
Age : 29
Date d'inscription : 12/06/2007

MessageSujet: Re: [Résolu] probleme de compilation   Lun 20 Oct 2008, 20:17

Merci de ta réponse si rapide,
Cela fonctionne parfaitement maintenant cependant je suis utilisateur d'Eclipse, connais-tu la façon de le faire sous eclipse et non pas seulement en invité de commande comme tu me l'as montré ?

Merci d'avance
Revenir en haut Aller en bas
Voir le profil de l'utilisateur http://www.fireemperor.fr/
Respawner



Nombre de messages : 1622
Age : 28
Date d'inscription : 20/04/2006

MessageSujet: Re: [Résolu] probleme de compilation   Lun 20 Oct 2008, 20:51

Jamais testé mais essaie avec Run > Run Configurations... > Maven Build > Ton Build à modifier et coche Skip Tests.

_________________
~$ cat new_server > /dev/null

Tout n'est qu'une question de point de vue.
Revenir en haut Aller en bas
Voir le profil de l'utilisateur http://www.respawner.fr/
Eristos



Nombre de messages : 43
Age : 29
Date d'inscription : 12/06/2007

MessageSujet: Re: [Résolu] probleme de compilation   Lun 20 Oct 2008, 22:07

cela marche nikel, Merci à toi
Revenir en haut Aller en bas
Voir le profil de l'utilisateur http://www.fireemperor.fr/
Contenu sponsorisé




MessageSujet: Re: [Résolu] probleme de compilation   Aujourd'hui à 09:50

Revenir en haut Aller en bas
 
[Résolu] probleme de compilation
Voir le sujet précédent Voir le sujet suivant Revenir en haut 
Page 1 sur 1
 Sujets similaires
-
» [Résolu] Probleme de son aprés etre passé sous XP
» [Résolu] Probleme http://seeearch.com/ en page d'acceuil
» [Résolu] Probleme de télechargement Woobrowser
» [Résolu] probleme bib
» [résolu]probleme nuvi 255wt

Permission de ce forum:Vous ne pouvez pas répondre aux sujets dans ce forum
L2J-FR :: Général :: Aides et Conseils-
Sauter vers: